Repository navigation
test(node): Port OpenAI integration tests to span streaming #60719
build.yml
on: pull_request
Get CI Metadata
/
Get Metadata
7s
Check PR branches
3s
Matrix: job_bun_integration_tests
Matrix: job_bundler_plugin_integration_tests
Matrix: job_cloudflare_integration_tests
Matrix: job_deno_integration_tests
Matrix: job_node_integration_tests
Matrix: job_node_unit_tests
Lint
1m 32s
Circular Dependency Check
1m 22s
Browser Unit Tests
2m 1s
Bun Unit Tests
48s
Deno Unit Tests
1m 1s
Check for faulty .d.ts files
34s
Matrix: job_browser_loader_tests
Matrix: job_browser_playwright_tests
Matrix: job_optional_e2e_tests
Matrix: job_e2e_tests
All required jobs passed or were skipped
3s
Annotations
11 errors and 332 notices
|
Deno Integration Tests (2/2)
Process completed with exit code 1.
|
|
suites/tracing/openai/v6/test.ts > OpenAI integration (V6) > it works with Azure OpenAI (v6) [cjs]:
dev-packages/node-integration-tests/suites/tracing/openai/v6/test.ts#L1123
AssertionError: expected undefined to be defined
β― suites/tracing/openai/v6/test.ts:1123:31
|
|
suites/tracing/openai/v6/test.ts > OpenAI integration (V6) > it works with Azure OpenAI (v6) [esm]:
dev-packages/node-integration-tests/suites/tracing/openai/v6/test.ts#L1123
AssertionError: expected undefined to be defined
β― suites/tracing/openai/v6/test.ts:1123:31
|
|
suites/tracing/openai/v6/test.ts > OpenAI integration (V6) > it works without a wrapping span (v6) [cjs]:
dev-packages/node-integration-tests/suites/tracing/openai/v6/test.ts#L1071
AssertionError: expected undefined to be defined
β― suites/tracing/openai/v6/test.ts:1071:31
|
|
suites/tracing/openai/v6/test.ts > OpenAI integration (V6) > it works without a wrapping span (v6) [esm]:
dev-packages/node-integration-tests/suites/tracing/openai/v6/test.ts#L1071
AssertionError: expected undefined to be defined
β― suites/tracing/openai/v6/test.ts:1071:31
|
|
[chromium] βΊ tests/db-drivers.test.ts:43:1 βΊ Instruments mysql automatically:
../../_temp/test-application/tests/db-drivers.test.ts#L66
1) [chromium] βΊ tests/db-drivers.test.ts:43:1 βΊ Instruments mysql automatically ββββββββββββββββββ
Error: expect(received).toContainEqual(expected) // deep equality
Expected value: ObjectContaining {"data": ObjectContaining {"db.connection_string": Any<String>, "db.query.text": "SELECT ? + ? AS solution", "db.system.name": "mysql", "db.user": "root", "server.address": Any<String>, "server.port": 3306}, "description": "SELECT ? + ? AS solution", "op": "db", "origin": "auto.db.mysql", "status": "ok"}
Received array: [{"data": {"http.request.method": "GET", "http.request.method_original": "GET", "http.response.status_code": 200, "sentry.kind": "client", "sentry.op": "http.client", "sentry.origin": "auto.http.node_fetch", "server.address": "localhost", "server.port": 3000, "url.domain": "localhost", "url.full": "http://localhost:3000/api/db-mysql", "url.path": "/api/db-mysql", "url.scheme": "http", "user_agent.original": "node"}, "description": "GET http://localhost:3000/api/db-mysql", "op": "http.client", "origin": "auto.http.node_fetch", "parent_span_id": "93aef10790d2e9bc", "span_id": "bbaffb9c78339664", "start_timestamp": 1791364889.4848328, "status": "ok", "timestamp": 1791364889.497888, "trace_id": "23afcddad89d482d94610480805923e8"}]
64 | const spans = transactionEvent.spans || [];
65 |
> 66 | expect(spans).toContainEqual(
| ^
67 | expect.objectContaining({
68 | op: 'db',
69 | origin: 'auto.db.mysql',
at /home/runner/work/_temp/test-application/tests/db-drivers.test.ts:66:17
|
|
E2E nuxt-3-min Test
Process completed with exit code 1.
|
|
[chromium] βΊ tests/errors.server.test.ts:39:3 βΊ server-side errors βΊ captures api fetch error (fetched on click) with parametrized route:
../../_temp/test-application/tests/errors.server.test.ts#L0
1) [chromium] βΊ tests/errors.server.test.ts:39:3 βΊ server-side errors βΊ captures api fetch error (fetched on click) with parametrized route
Test timeout of 30000ms exceeded.
|
|
E2E cloudflare-flue-send-to-sentry Test (optional)
Process completed with exit code 1.
|
|
[chromium] βΊ tests/flue.test.ts:64:1 βΊ nests a manual span raised inside a tool under that tool span:
../../_temp/test-application/tests/flue.test.ts#L77
1) [chromium] βΊ tests/flue.test.ts:64:1 βΊ nests a manual span raised inside a tool under that tool span
Error: expect(received).toEqual(expected) // deep equality
Expected: ArrayContaining ["execute_tool get_weather", "resolve-weather"]
Received: ["alarm", "SELECT sequence, submission_id, session_key, kind, payload, status, accepted_at, canonical_ready_at, attempt_id, input_applied_at, abort_requested_at, started_at, joined_into, error, settled_at, attempt_count, max_attempts, timeout_at, owner_id, lease_expires_at FROM flue_agent_submissions WHERE status = ? ORDER BY sequence ASC", "", "SELECT ? FROM flue_agent_submissions WHERE status IN (?) LIMIT ?", "SELECT submission_id, session_key, attempt_id, settlement_record_id, settlement_record FROM flue_agent_submissions WHERE status = ? ORDER BY sequence ASC", "SELECT sequence, submission_id, session_key, kind, payload, status, accepted_at, canonical_ready_at, attempt_id, input_applied_at, abort_requested_at, started_at, joined_into, error, settled_at, attempt_count, max_attempts, timeout_at, owner_id, lease_expires_at FROM flue_agent_submissions WHERE submission_id = ? LIMIT ?", "SELECT ? FROM flue_agent_submissions WHERE status IN (?) LIMIT ?", "SELECT submission_id, session_key, attempt_id, settlement_record_id, settlement_record FROM flue_agent_submissions WHERE status = ? ORDER BY sequence ASC", "UPDATE flue_agent_submissions SET attempt_id = ?, started_at = ?, attempt_count = attempt_count + ?, owner_id = ?, lease_expires_at = ? WHERE submission_id = ? AND status = ? AND attempt_id = ? RETURNING sequence, submission_id, session_key, kind, payload, status, accepted_at, canonical_ready_at, attempt_id, input_applied_at, abort_requested_at, started_at, joined_into, error, settled_at, attempt_count, max_attempts, timeout_at, owner_id, lease_expires_at", "SELECT identity_json, next_offset, producer_id, producer_epoch, next_producer_sequence, incarnation FROM flue_conversation_streams WHERE path = ?", β¦]
Call Log:
- Timeout 180000ms exceeded while waiting on the predicate
75 | await expect
76 | .poll(() => (spans = flattenTrace(fetchTrace(traceId!))).map(span => span.description), EVENT_POLLING_OPTIONS)
> 77 | .toEqual(expect.arrayContaining(['execute_tool get_weather', 'resolve-weather']));
| ^
78 |
79 | const executeTool = spans.find(span => span.op === 'gen_ai.execute_tool');
80 | const manualSpan = spans.find(span => span.description === 'resolve-weather');
at /home/runner/work/_temp/test-application/tests/flue.test.ts:77:6
|
|
All required jobs passed or were skipped
Process completed with exit code 1.
|
|
π Playwright Run Summary
1 skipped
19 passed (1.3s)
|
|
π Playwright Run Summary
1 passed (5.3s)
|
|
π Playwright Run Summary
1 passed (5.9s)
|
|
π Playwright Run Summary
1 skipped
19 passed (8.5s)
|
|
π Playwright Run Summary
12 passed (10.0s)
|
|
π Playwright Run Summary
12 passed (10.0s)
|
|
π Playwright Run Summary
16 passed (10.3s)
|
|
π Playwright Run Summary
4 passed (4.2s)
|
|
π Playwright Run Summary
15 passed (8.5s)
|
|
π Playwright Run Summary
7 passed (3.3s)
|
|
π Playwright Run Summary
5 passed (6.6s)
|
|
π Playwright Run Summary
23 passed (14.4s)
|
|
π Playwright Run Summary
8 passed (6.9s)
|
|
π Playwright Run Summary
77 passed (4.4s)
|
|
π Playwright Run Summary
4 passed (8.9s)
|
|
π Playwright Run Summary
11 passed (8.3s)
|
|
π Playwright Run Summary
6 passed (14.0s)
|
|
π Playwright Run Summary
2 passed (3.1s)
|
|
π Playwright Run Summary
1 passed (3.4s)
|
|
π Playwright Run Summary
3 passed (4.1s)
|
|
π Playwright Run Summary
2 passed (3.4s)
|
|
π Playwright Run Summary
2 passed (3.4s)
|
|
π Playwright Run Summary
7 passed (3.3s)
|
|
π Playwright Run Summary
11 skipped
2 passed (3.4s)
|
|
π Playwright Run Summary
1 passed (4.4s)
|
|
π Playwright Run Summary
23 passed (19.8s)
|
|
π Playwright Run Summary
5 passed (11.8s)
|
|
π Playwright Run Summary
10 passed (3.6s)
|
|
π Playwright Run Summary
10 passed (3.8s)
|
|
π Playwright Run Summary
22 passed (15.1s)
|
|
π Playwright Run Summary
5 passed (9.1s)
|
|
π Playwright Run Summary
5 passed (12.5s)
|
|
π Playwright Run Summary
4 passed (3.2s)
|
|
π Playwright Run Summary
3 skipped
17 passed (8.3s)
|
|
π Playwright Run Summary
8 passed (10.4s)
|
|
π Playwright Run Summary
5 passed (13.3s)
|
|
π Playwright Run Summary
1 skipped
76 passed (14.7s)
|
|
π Playwright Run Summary
11 passed (11.4s)
|
|
π Playwright Run Summary
10 passed (8.4s)
|
|
π Playwright Run Summary
1 passed (4.6s)
|
|
π Playwright Run Summary
11 passed (10.0s)
|
|
π Playwright Run Summary
1 skipped
76 passed (14.7s)
|
|
π Playwright Run Summary
4 passed (9.3s)
|
|
π Playwright Run Summary
1 passed (2.9s)
|
|
π Playwright Run Summary
9 passed (12.4s)
|
|
π Playwright Run Summary
5 passed (7.0s)
|
|
π Playwright Run Summary
5 passed (11.3s)
|
|
π Playwright Run Summary
4 passed (32.8s)
|
|
π Playwright Run Summary
7 passed (8.3s)
|
|
π Playwright Run Summary
4 passed (5.8s)
|
|
π Playwright Run Summary
4 passed (7.1s)
|
|
π Playwright Run Summary
16 passed (10.3s)
|
|
π Playwright Run Summary
1 skipped
76 passed (15.6s)
|
|
π Playwright Run Summary
10 passed (8.4s)
|
|
π Playwright Run Summary
10 passed (11.7s)
|
|
π Playwright Run Summary
8 passed (8.7s)
|
|
π Playwright Run Summary
9 passed (3.5s)
|
|
π Playwright Run Summary
9 passed (3.5s)
|
|
π Playwright Run Summary
11 passed (9.4s)
|
|
π Playwright Run Summary
6 passed (16.1s)
|
|
π Playwright Run Summary
1 passed (5.1s)
|
|
π Playwright Run Summary
11 passed (7.0s)
|
|
π Playwright Run Summary
12 passed (21.4s)
|
|
π Playwright Run Summary
12 passed (7.8s)
|
|
π Playwright Run Summary
2 passed (4.5s)
|
|
π Playwright Run Summary
7 passed (11.3s)
|
|
π Playwright Run Summary
7 passed (16.6s)
|
|
π Playwright Run Summary
2 skipped
14 passed (16.6s)
|
|
π Playwright Run Summary
4 passed (4.0s)
|
|
π Playwright Run Summary
20 passed (15.0s)
|
|
π Playwright Run Summary
19 passed (14.4s)
|
|
π Playwright Run Summary
16 passed (20.2s)
|
|
π Playwright Run Summary
4 skipped
10 passed (17.3s)
|
|
π Playwright Run Summary
10 passed (19.4s)
|
|
π Playwright Run Summary
15 passed (31.5s)
|
|
π Playwright Run Summary
5 passed (8.8s)
|
|
π Playwright Run Summary
3 passed (5.1s)
|
|
π Playwright Run Summary
16 passed (20.2s)
|
|
π Playwright Run Summary
3 passed (2.8s)
|
|
π Playwright Run Summary
2 passed (3.6s)
|
|
π Playwright Run Summary
2 passed (3.6s)
|
|
π Playwright Run Summary
23 passed (22.4s)
|
|
π Playwright Run Summary
9 passed (14.3s)
|
|
π Playwright Run Summary
11 passed (9.8s)
|
|
π Playwright Run Summary
5 passed (14.2s)
|
|
π Playwright Run Summary
1 passed (3.4s)
|
|
π Playwright Run Summary
3 passed (3.9s)
|
|
π Playwright Run Summary
5 passed (8.0s)
|
|
π Playwright Run Summary
1 skipped
76 passed (16.2s)
|
|
π Playwright Run Summary
5 passed (13.7s)
|
|
π Playwright Run Summary
77 passed (15.9s)
|
|
π Playwright Run Summary
1 skipped
12 passed (27.4s)
|
|
π Playwright Run Summary
4 passed (2.6s)
|
|
π Playwright Run Summary
77 passed (15.5s)
|
|
π Playwright Run Summary
15 passed (41.7s)
|
|
π Playwright Run Summary
1 passed (5.1s)
|
|
π Playwright Run Summary
1 passed (3.6s)
|
|
π Playwright Run Summary
1 passed (3.6s)
|
|
π Playwright Run Summary
6 passed (34.9s)
|
|
π Playwright Run Summary
25 passed (18.2s)
|
|
π Playwright Run Summary
2 skipped
10 passed (5.6s)
|
|
π Playwright Run Summary
2 skipped
10 passed (6.0s)
|
|
π Playwright Run Summary
4 passed (17.0s)
|
|
π Playwright Run Summary
4 passed (10.1s)
|
|
π Playwright Run Summary
4 passed (16.4s)
|
|
π Playwright Run Summary
4 passed (11.3s)
|
|
π Playwright Run Summary
2 passed (31.2s)
|
|
π Playwright Run Summary
8 skipped
6 passed (11.5s)
|
|
π Playwright Run Summary
30 passed (34.5s)
|
|
π Playwright Run Summary
8 passed (6.5s)
|
|
π Playwright Run Summary
5 passed (12.6s)
|
|
π Playwright Run Summary
25 skipped
2 passed (3.6s)
|
|
π Playwright Run Summary
12 passed (38.5s)
|
|
π Playwright Run Summary
4 passed (11.7s)
|
|
π Playwright Run Summary
15 passed (16.8s)
|
|
π Playwright Run Summary
3 passed (15.9s)
|
|
π Playwright Run Summary
3 passed (11.5s)
|
|
π Playwright Run Summary
9 passed (12.7s)
|
|
π Playwright Run Summary
19 passed (31.5s)
|
|
π Playwright Run Summary
5 passed (11.2s)
|
|
π Playwright Run Summary
3 passed (6.3s)
|
|
π Playwright Run Summary
25 skipped
2 passed (3.6s)
|
|
π Playwright Run Summary
4 passed (6.9s)
|
|
π Playwright Run Summary
15 passed (41.8s)
|
|
π Playwright Run Summary
4 passed (10.5s)
|
|
π Playwright Run Summary
2 passed (35.5s)
|
|
π Playwright Run Summary
15 passed (28.2s)
|
|
π Playwright Run Summary
77 passed (15.1s)
|
|
π Playwright Run Summary
13 passed (44.0s)
|
|
π Playwright Run Summary
1 passed (18.5s)
|
|
π Playwright Run Summary
30 passed (31.0s)
|
|
π Playwright Run Summary
4 passed (11.8s)
|
|
π Playwright Run Summary
4 passed (4.8s)
|
|
π Playwright Run Summary
15 passed (42.1s)
|
|
π Playwright Run Summary
10 passed (25.9s)
|
|
π Playwright Run Summary
3 passed (6.5s)
|
|
π Playwright Run Summary
12 passed (38.9s)
|
|
π Playwright Run Summary
13 passed (44.0s)
|
|
π Playwright Run Summary
25 skipped
2 passed (4.5s)
|
|
π Playwright Run Summary
5 passed (13.4s)
|
|
π Playwright Run Summary
500 skipped
188 passed (30.2s)
|
|
π Playwright Run Summary
4 passed (3.3s)
|
|
π Playwright Run Summary
495 skipped
193 passed (32.1s)
|
|
π Playwright Run Summary
14 passed (20.5s)
|
|
π Playwright Run Summary
15 passed (34.7s)
|
|
π Playwright Run Summary
13 passed (31.5s)
|
|
π Playwright Run Summary
13 passed (12.9s)
|
|
π Playwright Run Summary
9 passed (12.1s)
|
|
π Playwright Run Summary
24 skipped
3 passed (3.0s)
|
|
π Playwright Run Summary
6 skipped
7 passed (24.0s)
|
|
π Playwright Run Summary
13 passed (17.1s)
|
|
π Playwright Run Summary
6 passed (14.6s)
|
|
π Playwright Run Summary
11 passed (20.0s)
|
|
π Playwright Run Summary
3 passed (33.1s)
|
|
π Playwright Run Summary
6 passed (46.6s)
|
|
π Playwright Run Summary
2 skipped
7 passed (32.0s)
|
|
π Playwright Run Summary
10 passed (42.2s)
|
|
π Playwright Run Summary
22 passed (45.4s)
|
|
π Playwright Run Summary
12 passed (17.2s)
|
|
π Playwright Run Summary
12 passed (17.3s)
|
|
π Playwright Run Summary
12 passed (36.4s)
|
|
π Playwright Run Summary
4 passed (16.3s)
|
|
π Playwright Run Summary
4 passed (9.3s)
|
|
π Playwright Run Summary
13 passed (33.6s)
|
|
π Playwright Run Summary
15 passed (42.3s)
|
|
π Playwright Run Summary
10 passed (19.8s)
|
|
π Playwright Run Summary
10 passed (13.1s)
|
|
π Playwright Run Summary
4 passed (20.5s)
|
|
π Playwright Run Summary
4 passed (11.0s)
|
|
π Playwright Run Summary
54 passed (34.1s)
|
|
π Playwright Run Summary
13 passed (41.5s)
|
|
π Playwright Run Summary
15 passed (40.3s)
|
|
π Playwright Run Summary
12 passed (20.5s)
|
|
π Playwright Run Summary
25 passed (59.1s)
|
|
π Playwright Run Summary
10 passed (18.8s)
|
|
π Playwright Run Summary
5 skipped
17 passed (24.2s)
|
|
π Playwright Run Summary
1 skipped
21 passed (20.0s)
|
|
π Playwright Run Summary
1 skipped
17 passed (33.5s)
|
|
π Playwright Run Summary
9 passed (12.3s)
|
|
π Playwright Run Summary
3 passed (18.7s)
|
|
π Playwright Run Summary
3 passed (14.3s)
|
|
π Playwright Run Summary
11 passed (19.7s)
|
|
π Playwright Run Summary
4 passed (22.6s)
|
|
π Playwright Run Summary
4 passed (11.8s)
|
|
π Playwright Run Summary
9 passed (37.4s)
|
|
π Playwright Run Summary
12 passed (32.2s)
|
|
π Playwright Run Summary
22 passed (36.1s)
|
|
π Playwright Run Summary
25 passed (54.1s)
|
|
π Playwright Run Summary
12 passed (39.5s)
|
|
π Playwright Run Summary
17 passed (1.1m)
|
|
π Playwright Run Summary
9 passed (15.5s)
|
|
π Playwright Run Summary
22 passed (46.7s)
|
|
π Playwright Run Summary
4 passed (14.9s)
|
|
π Playwright Run Summary
11 passed (36.4s)
|
|
π Playwright Run Summary
40 passed (35.3s)
|
|
π Playwright Run Summary
12 passed (41.7s)
|
|
π Playwright Run Summary
2 passed (18.2s)
|
|
π Playwright Run Summary
15 passed (53.8s)
|
|
π Playwright Run Summary
11 passed (44.6s)
|
|
π Playwright Run Summary
3 passed (36.3s)
|
|
π Playwright Run Summary
3 passed (7.7s)
|
|
π Playwright Run Summary
2 passed (30.9s)
|
|
π Playwright Run Summary
9 passed (12.1s)
|
|
π Playwright Run Summary
16 passed (1.3m)
|
|
π Playwright Run Summary
16 skipped
12 passed (28.1s)
|
|
π Playwright Run Summary
4 skipped
12 passed (23.7s)
|
|
π Playwright Run Summary
2 skipped
14 passed (14.7s)
|
|
π Playwright Run Summary
364 skipped
324 passed (58.1s)
|
|
π Playwright Run Summary
2 passed (16.2s)
|
|
π Playwright Run Summary
13 passed (40.9s)
|
|
π Playwright Run Summary
5 passed (33.4s)
|
|
π Playwright Run Summary
5 passed (34.0s)
|
|
π Playwright Run Summary
3 passed (33.8s)
|
|
π Playwright Run Summary
3 passed (3.8s)
|
|
π Playwright Run Summary
9 passed (33.2s)
|
|
π Playwright Run Summary
10 passed (30.1s)
|
|
π Playwright Run Summary
10 passed (42.6s)
|
|
π Playwright Run Summary
40 passed (35.2s)
|
|
π Playwright Run Summary
1 flaky
[chromium] βΊ tests/db-drivers.test.ts:43:1 βΊ Instruments mysql automatically βββββββββββββββββββ
1 passed (19.1s)
|
|
π Playwright Run Summary
2 skipped
21 passed (38.0s)
|
|
π Playwright Run Summary
4 passed (33.0s)
|
|
π Playwright Run Summary
4 passed (10.4s)
|
|
π Playwright Run Summary
7 skipped
23 passed (6.8s)
|
|
π Playwright Run Summary
5 passed (33.3s)
|
|
π Playwright Run Summary
5 passed (32.6s)
|
|
π Playwright Run Summary
16 skipped
12 passed (27.1s)
|
|
π Playwright Run Summary
13 passed (39.6s)
|
|
π Playwright Run Summary
13 passed (14.7s)
|
|
π Playwright Run Summary
10 passed (11.8s)
|
|
π Playwright Run Summary
10 passed (25.5s)
|
|
π Playwright Run Summary
10 passed (6.2s)
|
|
π Playwright Run Summary
8 passed (43.6s)
|
|
π Playwright Run Summary
8 passed (16.3s)
|
|
π Playwright Run Summary
1 skipped
28 passed (1.1m)
|
|
π Playwright Run Summary
2 passed (16.7s)
|
|
π Playwright Run Summary
11 passed (42.3s)
|
|
π Playwright Run Summary
10 passed (55.2s)
|
|
π Playwright Run Summary
2 passed (17.4s)
|
|
π Playwright Run Summary
15 passed (52.9s)
|
|
π Playwright Run Summary
2 passed (20.1s)
|
|
π Playwright Run Summary
3 skipped
24 passed (45.6s)
|
|
π Playwright Run Summary
7 skipped
23 passed (9.7s)
|
|
π Playwright Run Summary
5 skipped
25 passed (11.6s)
|
|
π Playwright Run Summary
2 passed (17.0s)
|
|
π Playwright Run Summary
13 passed (34.3s)
|
|
π Playwright Run Summary
4 skipped
26 passed (19.1s)
|
|
π Playwright Run Summary
13 passed (47.9s)
|
|
π Playwright Run Summary
13 passed (14.9s)
|
|
π Playwright Run Summary
5 skipped
25 passed (14.9s)
|
|
π Playwright Run Summary
1 skipped
28 passed (1.2m)
|
|
π Playwright Run Summary
2 passed (16.1s)
|
|
π Playwright Run Summary
19 passed (53.5s)
|
|
π Playwright Run Summary
3 passed (36.5s)
|
|
π Playwright Run Summary
3 passed (13.0s)
|
|
π Playwright Run Summary
1 skipped
29 passed (19.9s)
|
|
π Playwright Run Summary
4 skipped
12 passed (35.1s)
|
|
π Playwright Run Summary
2 skipped
14 passed (15.8s)
|
|
π Playwright Run Summary
2 passed (16.3s)
|
|
π Playwright Run Summary
18 passed (1.1m)
|
|
π Playwright Run Summary
1 skipped
28 passed (1.3m)
|
|
π Playwright Run Summary
29 passed (1.3m)
|
|
π Playwright Run Summary
7 passed (1.6m)
|
|
π Playwright Run Summary
4 passed (15.5s)
|
|
π Playwright Run Summary
4 skipped
53 passed (1.5m)
|
|
π Playwright Run Summary
6 skipped
7 passed (44.5s)
|
|
π Playwright Run Summary
13 passed (18.4s)
|
|
π Playwright Run Summary
29 passed (1.4m)
|
|
π Playwright Run Summary
8 skipped
22 passed (9.0s)
|
|
π Playwright Run Summary
5 skipped
30 passed (1.1m)
|
|
π Playwright Run Summary
5 skipped
30 passed (47.2s)
|
|
π Playwright Run Summary
498 skipped
190 passed (30.2s)
|
|
π Playwright Run Summary
198 skipped
490 passed (1.7m)
|
|
π Playwright Run Summary
1 failed
[chromium] βΊ tests/errors.server.test.ts:39:3 βΊ server-side errors βΊ captures api fetch error (fetched on click) with parametrized route
16 passed (1.6m)
|
|
π Playwright Run Summary
4 skipped
17 passed (59.6s)
|
|
π Playwright Run Summary
1 skipped
20 passed (30.7s)
|
|
π Playwright Run Summary
4 passed (17.2s)
|
|
π Playwright Run Summary
2 passed (16.5s)
|
|
π Playwright Run Summary
5 skipped
17 passed (1.3m)
|
|
π Playwright Run Summary
1 skipped
21 passed (21.2s)
|
|
π Playwright Run Summary
1 skipped
5 passed (21.9s)
|
|
π Playwright Run Summary
58 passed (1.6m)
|
|
π Playwright Run Summary
59 skipped
629 passed (2.4m)
|
|
π Playwright Run Summary
363 skipped
325 passed (1.0m)
|
|
π Playwright Run Summary
4 skipped
168 passed (2.0m)
|
|
π Playwright Run Summary
57 skipped
631 passed (2.3m)
|
|
π Playwright Run Summary
4 skipped
17 passed (37.8s)
|
|
π Playwright Run Summary
1 skipped
20 passed (39.2s)
|
|
π Playwright Run Summary
61 skipped
627 passed (2.2m)
|
|
π Playwright Run Summary
4 skipped
30 passed (59.1s)
|
|
π Playwright Run Summary
2 skipped
32 passed (1.4m)
|
|
π Playwright Run Summary
190 skipped
498 passed (2.0m)
|
|
π Playwright Run Summary
1 skipped
5 passed (24.4s)
|
|
π Playwright Run Summary
58 passed (1.7m)
|
|
π Playwright Run Summary
1 skipped
5 passed (23.4s)
|
|
π Playwright Run Summary
58 passed (1.7m)
|
|
π Playwright Run Summary
1 skipped
6 passed (23.1s)
|
|
π Playwright Run Summary
76 passed (2.3m)
|
|
π Playwright Run Summary
4 skipped
168 passed (1.7m)
|
|
π Playwright Run Summary
15 skipped
32 passed (1.7m)
|
|
π Playwright Run Summary
5 skipped
42 passed (1.3m)
|
|
π Playwright Run Summary
1 skipped
171 passed (1.8m)
|
|
π Playwright Run Summary
1 skipped
6 passed (24.0s)
|
|
π Playwright Run Summary
76 passed (2.4m)
|
|
π Playwright Run Summary
44 passed (2.6m)
|
|
π Playwright Run Summary
76 passed (2.4m)
|
|
π Playwright Run Summary
194 skipped
494 passed (2.0m)
|
|
π Playwright Run Summary
5 skipped
30 passed (2.2m)
|
|
π Playwright Run Summary
4 skipped
31 passed (49.8s)
|
|
π Playwright Run Summary
1 skipped
6 passed (28.7s)
|
|
π Playwright Run Summary
76 passed (2.3m)
|
|
π Playwright Run Summary
6 skipped
166 passed (2.2m)
|
|
π Playwright Run Summary
5 skipped
30 passed (2.2m)
|
|
π Playwright Run Summary
4 skipped
31 passed (51.2s)
|
|
π Playwright Run Summary
61 skipped
627 passed (2.4m)
|
|
π Playwright Run Summary
2 skipped
32 passed (2.3m)
|
|
π Playwright Run Summary
2 skipped
32 passed (1.2m)
|
|
π Playwright Run Summary
57 skipped
631 passed (2.5m)
|
|
π Playwright Run Summary
1 failed
[chromium] βΊ tests/flue.test.ts:64:1 βΊ nests a manual span raised inside a tool under that tool span
3 passed (3.9m)
|
|
π Playwright Run Summary
16 skipped
38 passed (2.2m)
|
|
π Playwright Run Summary
5 skipped
49 passed (1.8m)
|
|
π Playwright Run Summary
16 skipped
38 passed (2.2m)
|
|
π Playwright Run Summary
5 skipped
49 passed (1.9m)
|
|
π Playwright Run Summary
2 skipped
32 passed (2.5m)
|
|
π Playwright Run Summary
2 skipped
32 passed (1.3m)
|
|
π Playwright Run Summary
16 skipped
38 passed (2.2m)
|
|
π Playwright Run Summary
5 skipped
49 passed (1.8m)
|
|
π Playwright Run Summary
13 skipped
41 passed (3.4m)
|
|
π Playwright Run Summary
5 skipped
49 passed (1.7m)
|
|
π Playwright Run Summary
13 skipped
41 passed (3.5m)
|
|
π Playwright Run Summary
5 skipped
49 passed (1.8m)
|
|
π Playwright Run Summary
13 skipped
41 passed (3.4m)
|
|
π Playwright Run Summary
5 skipped
49 passed (1.7m)
|
Artifacts
Produced during runtime
| Name | Size | Digest | |
|---|---|---|---|
|
build-bundle-output
|
20.5 MB |
sha256:4b4e0392c0142b5df35e922d2022a6e57d888762df32a7e83d4db43798db14b4
|
|
|
build-layer-output
|
1.38 MB |
sha256:27536ea4d38e5356079a3fcb68bbdc1bc19fa6734737d941bc492fd26ecf6c7e
|
|
|
build-output
|
14.7 MB |
sha256:bc59e5f305e2752a1d54f98b4d31fd20ad1df82b75718f4e70486096a05816bb
|
|
|
build-tarball-output
|
7.5 MB |
sha256:31db9194ec8964f2b802e4b823d9df549d96d1b48468cfb5e7de19696e5cb46e
|
|
|
playwright-traces-job_e2e_playwright_tests-nuxt-3-min
|
47 KB |
sha256:4f386e7c62c028c90e95fbc6d729e00219e1958a745fa6c84b82471c7147ec84
|
|