Repository navigation
test(e2e): Move react-router-8-cloudflare MySQL tests into react-router-8-framework #58798
Triggered via pull request
September 23, 2026 16:59
Status
Failure
Total duration
23m 12s
Artifacts
–
build.yml
on: pull_request
Get CI Metadata
/
Get Metadata
6s
Check PR branches
4s
Matrix: job_bundler_plugin_integration_tests
Matrix: job_node_integration_tests
Matrix: job_node_unit_tests
Lint
1m 34s
Circular Dependency Check
1m 44s
Browser Unit Tests
2m 34s
Bun Unit Tests
55s
Deno Unit Tests
1m 10s
Cloudflare Integration Tests
6m 43s
Bun Integration Tests
5m 49s
Deno Integration Tests
7m 24s
Check for faulty .d.ts files
47s
Matrix: job_browser_loader_tests
Matrix: job_browser_playwright_tests
Matrix: job_optional_e2e_tests
Matrix: job_e2e_tests
All required jobs passed or were skipped
5s
Annotations
19 errors and 317 notices
|
E2E nextjs-16-standalone (canary, turbopack) Test (optional)
Process completed with exit code 1.
|
|
E2E nextjs-16 (canary, turbopack) Test (optional)
Process completed with exit code 1.
|
|
E2E cloudflare-workers-static Test
Process completed with exit code 1.
|
|
[chromium] βΊ tests/index.test.ts:42:5 βΊ Websocket.webSocketMessage:
../../_temp/test-application/tests/index.test.ts#L53
1) [chromium] βΊ tests/index.test.ts:42:5 βΊ Websocket.webSocketMessage ββββββββββββββββββββββββββββ
Error: WebSocket was closed before the connection was established
51 | });
52 | const event = await eventWaiter;
> 53 | socket.close();
| ^
54 | expect(event.exception?.values?.[0]?.value).toBe('Should be recorded in Sentry: webSocketMessage');
55 | expect(event.exception?.values?.[0]?.mechanism?.type).toBe('auto.faas.cloudflare.durable_object');
56 | });
at WebSocket.close (/home/runner/work/_temp/test-application/node_modules/.pnpm/ws@8.21.3/node_modules/ws/lib/websocket.js:306:7)
at /home/runner/work/_temp/test-application/tests/index.test.ts:53:10
|
|
[chromium] βΊ tests/index.test.ts:42:5 βΊ Websocket.webSocketMessage:
../../_temp/test-application/tests/index.test.ts#L54
1) [chromium] βΊ tests/index.test.ts:42:5 βΊ Websocket.webSocketMessage ββββββββββββββββββββββββββββ
Error: expect(received).toBe(expected) // Object.is equality
Expected: "Should be recorded in Sentry: webSocketMessage"
Received: "Should be recorded in Sentry."
52 | const event = await eventWaiter;
53 | socket.close();
> 54 | expect(event.exception?.values?.[0]?.value).toBe('Should be recorded in Sentry: webSocketMessage');
| ^
55 | expect(event.exception?.values?.[0]?.mechanism?.type).toBe('auto.faas.cloudflare.durable_object');
56 | });
57 |
at /home/runner/work/_temp/test-application/tests/index.test.ts:54:47
|
|
Node (20.19) Unit Tests
Process completed with exit code 1.
|
|
test/webpack/child-compiler.test.ts > child compiler injection > injects release information into child-compiler bundles:
packages/bundler-plugins/test/webpack/child-compiler.test.ts#L56
Error: Test timed out in 5000ms.
If this is a long-running test, pass a timeout value as the last argument or configure it globally with "testTimeout".
β― test/webpack/child-compiler.test.ts:56:3
|
|
E2E react-router-7-framework-static Test
Process completed with exit code 1.
|
|
[chromium] βΊ tests/performance/trace-propagation.test.ts:20:3 βΊ Trace propagation βΊ should have trace connection:
../../_temp/test-application/tests/performance/trace-propagation.test.ts#L0
1) [chromium] βΊ tests/performance/trace-propagation.test.ts:20:3 βΊ Trace propagation βΊ should have trace connection
Test timeout of 30000ms exceeded.
|
|
Cloudflare Integration Tests
Process completed with exit code 1.
|
|
suites/tracing/headers/test.ts > Tracing headers:
dev-packages/cloudflare-integration-tests/runner.ts#L264
AssertionError: expected [ { β¦(4) }, β¦(1) ] to deeply equal [ { β¦(4) }, β¦(1) ]
- Expected
+ Received
@@ -80,10 +80,11 @@
},
],
"version": "11.0.0",
},
"timestamp": Any<Number>,
+ "transaction": "GET /",
"user": {
"ip_address": "127.0.0.1",
},
},
],
β― assertEnvelopeMatches runner.ts:264:28
β― newEnvelope runner.ts:328:13
β― ../test-utils/src/server.ts:19:7
β― Layer.handle [as handle_request] ../../node_modules/express/lib/router/layer.js:95:5
β― next ../../node_modules/express/lib/router/route.js:149:13
β― Route.dispatch ../../node_modules/express/lib/router/route.js:119:3
β― Layer.handle [as handle_request] ../../node_modules/express/lib/router/layer.js:95:5
β― ../../node_modules/express/lib/router/index.js:284:15
β― param ../../node_modules/express/lib/router/index.js:365:14
β― param ../../node_modules/express/lib/router/index.js:376:14
|
|
suites/tracing/dsc-url-source/test.ts > omits the span name from the DSC for url-source spans when tracing is enabled:
dev-packages/cloudflare-integration-tests/suites/tracing/dsc-url-source/test.ts#L5
Error: Test timed out in 60000ms.
If this is a long-running test, pass a timeout value as the last argument or configure it globally with "testTimeout".
β― suites/tracing/dsc-url-source/test.ts:5:1
|
|
suites/integrations/http-server/test.ts > Does not capture body for POST without content:
dev-packages/cloudflare-integration-tests/runner.ts#L264
AssertionError: expected [ { β¦(4) }, β¦(1) ] to deeply equal [ { β¦(4) }, β¦(1) ]
- Expected
+ Received
@@ -54,10 +54,11 @@
},
],
"version": "11.0.0",
},
"timestamp": Any<Number>,
+ "transaction": "POST /post-no-body",
"user": {
"ip_address": "127.0.0.1",
},
},
],
β― assertEnvelopeMatches runner.ts:264:28
β― newEnvelope runner.ts:328:13
β― ../test-utils/src/server.ts:19:7
β― Layer.handle [as handle_request] ../../node_modules/express/lib/router/layer.js:95:5
β― next ../../node_modules/express/lib/router/route.js:149:13
β― Route.dispatch ../../node_modules/express/lib/router/route.js:119:3
β― Layer.handle [as handle_request] ../../node_modules/express/lib/router/layer.js:95:5
β― ../../node_modules/express/lib/router/index.js:284:15
β― param ../../node_modules/express/lib/router/index.js:365:14
β― param ../../node_modules/express/lib/router/index.js:376:14
|
|
suites/integrations/http-server/test.ts > Captures plain text request body:
dev-packages/cloudflare-integration-tests/runner.ts#L264
AssertionError: expected [ { β¦(4) }, β¦(1) ] to deeply equal [ { β¦(4) }, β¦(1) ]
- Expected
+ Received
@@ -55,10 +55,11 @@
},
],
"version": "11.0.0",
},
"timestamp": Any<Number>,
+ "transaction": "POST /post-text",
"user": {
"ip_address": "127.0.0.1",
},
},
],
β― assertEnvelopeMatches runner.ts:264:28
β― newEnvelope runner.ts:328:13
β― ../test-utils/src/server.ts:19:7
β― Layer.handle [as handle_request] ../../node_modules/express/lib/router/layer.js:95:5
β― next ../../node_modules/express/lib/router/route.js:149:13
β― Route.dispatch ../../node_modules/express/lib/router/route.js:119:3
β― Layer.handle [as handle_request] ../../node_modules/express/lib/router/layer.js:95:5
β― ../../node_modules/express/lib/router/index.js:284:15
β― param ../../node_modules/express/lib/router/index.js:365:14
β― param ../../node_modules/express/lib/router/index.js:376:14
|
|
suites/integrations/http-server/test.ts > Captures form-urlencoded request body:
dev-packages/cloudflare-integration-tests/runner.ts#L264
AssertionError: expected [ { β¦(4) }, β¦(1) ] to deeply equal [ { β¦(4) }, β¦(1) ]
- Expected
+ Received
@@ -55,10 +55,11 @@
},
],
"version": "11.0.0",
},
"timestamp": Any<Number>,
+ "transaction": "POST /post-form",
"user": {
"ip_address": "127.0.0.1",
},
},
],
β― assertEnvelopeMatches runner.ts:264:28
β― newEnvelope runner.ts:328:13
β― ../test-utils/src/server.ts:19:7
β― Layer.handle [as handle_request] ../../node_modules/express/lib/router/layer.js:95:5
β― next ../../node_modules/express/lib/router/route.js:149:13
β― Route.dispatch ../../node_modules/express/lib/router/route.js:119:3
β― Layer.handle [as handle_request] ../../node_modules/express/lib/router/layer.js:95:5
β― ../../node_modules/express/lib/router/index.js:284:15
β― param ../../node_modules/express/lib/router/index.js:365:14
β― param ../../node_modules/express/lib/router/index.js:376:14
|
|
suites/integrations/http-server/test.ts > Captures JSON request body:
dev-packages/cloudflare-integration-tests/runner.ts#L264
AssertionError: expected [ { β¦(4) }, β¦(1) ] to deeply equal [ { β¦(4) }, β¦(1) ]
- Expected
+ Received
@@ -55,10 +55,11 @@
},
],
"version": "11.0.0",
},
"timestamp": Any<Number>,
+ "transaction": "POST /post-json",
"user": {
"ip_address": "127.0.0.1",
},
},
],
β― assertEnvelopeMatches runner.ts:264:28
β― newEnvelope runner.ts:328:13
β― ../test-utils/src/server.ts:19:7
β― Layer.handle [as handle_request] ../../node_modules/express/lib/router/layer.js:95:5
β― next ../../node_modules/express/lib/router/route.js:149:13
β― Route.dispatch ../../node_modules/express/lib/router/route.js:119:3
β― Layer.handle [as handle_request] ../../node_modules/express/lib/router/layer.js:95:5
β― ../../node_modules/express/lib/router/index.js:284:15
β― param ../../node_modules/express/lib/router/index.js:365:14
β― param ../../node_modules/express/lib/router/index.js:376:14
|
|
suites/double-instrumentation/test.ts > Only sends one error event when withSentry is called twice:
dev-packages/cloudflare-integration-tests/runner.ts#L264
AssertionError: expected [ { β¦(4) }, β¦(1) ] to deeply equal [ { β¦(4) }, β¦(1) ]
- Expected
+ Received
@@ -68,10 +68,11 @@
},
],
"version": "11.0.0",
},
"timestamp": Any<Number>,
+ "transaction": "GET /error",
"user": {
"ip_address": "127.0.0.1",
},
},
],
β― assertEnvelopeMatches runner.ts:264:28
β― newEnvelope runner.ts:328:13
β― ../test-utils/src/server.ts:19:7
β― Layer.handle [as handle_request] ../../node_modules/express/lib/router/layer.js:95:5
β― next ../../node_modules/express/lib/router/route.js:149:13
β― Route.dispatch ../../node_modules/express/lib/router/route.js:119:3
β― Layer.handle [as handle_request] ../../node_modules/express/lib/router/layer.js:95:5
β― ../../node_modules/express/lib/router/index.js:284:15
β― param ../../node_modules/express/lib/router/index.js:365:14
β― param ../../node_modules/express/lib/router/index.js:376:14
|
|
suites/basic/test.ts > Basic error in fetch handler:
dev-packages/cloudflare-integration-tests/runner.ts#L264
AssertionError: expected [ { β¦(4) }, β¦(1) ] to deeply equal [ { β¦(4) }, β¦(1) ]
- Expected
+ Received
@@ -68,10 +68,11 @@
},
],
"version": "11.0.0",
},
"timestamp": Any<Number>,
+ "transaction": "GET /",
"user": {
"ip_address": "127.0.0.1",
},
},
],
β― assertEnvelopeMatches runner.ts:264:28
β― newEnvelope runner.ts:328:13
β― ../test-utils/src/server.ts:19:7
β― Layer.handle [as handle_request] ../../node_modules/express/lib/router/layer.js:95:5
β― next ../../node_modules/express/lib/router/route.js:149:13
β― Route.dispatch ../../node_modules/express/lib/router/route.js:119:3
β― Layer.handle [as handle_request] ../../node_modules/express/lib/router/layer.js:95:5
β― ../../node_modules/express/lib/router/index.js:284:15
β― param ../../node_modules/express/lib/router/index.js:365:14
β― param ../../node_modules/express/lib/router/index.js:376:14
|
|
All required jobs passed or were skipped
Process completed with exit code 1.
|
|
π Playwright Run Summary
2 passed (3.6s)
|
|
π Playwright Run Summary
1 passed (6.0s)
|
|
π Playwright Run Summary
8 passed (7.1s)
|
|
π Playwright Run Summary
2 passed (5.2s)
|
|
π Playwright Run Summary
4 passed (7.9s)
|
|
π Playwright Run Summary
7 passed (3.3s)
|
|
π Playwright Run Summary
12 passed (11.4s)
|
|
π Playwright Run Summary
3 passed (4.1s)
|
|
π Playwright Run Summary
10 passed (10.2s)
|
|
π Playwright Run Summary
5 passed (6.8s)
|
|
π Playwright Run Summary
5 passed (13.5s)
|
|
π Playwright Run Summary
23 passed (15.4s)
|
|
π Playwright Run Summary
6 passed (14.3s)
|
|
π Playwright Run Summary
4 passed (4.0s)
|
|
π Playwright Run Summary
2 passed (5.5s)
|
|
π Playwright Run Summary
7 passed (5.2s)
|
|
π Playwright Run Summary
1 passed (7.1s)
|
|
π Playwright Run Summary
12 passed (8.5s)
|
|
π Playwright Run Summary
2 passed (4.1s)
|
|
π Playwright Run Summary
2 passed (4.1s)
|
|
π Playwright Run Summary
2 skipped
14 passed (16.8s)
|
|
π Playwright Run Summary
3 skipped
17 passed (8.4s)
|
|
π Playwright Run Summary
5 passed (14.8s)
|
|
π Playwright Run Summary
1 passed (3.6s)
|
|
π Playwright Run Summary
1 passed (3.6s)
|
|
π Playwright Run Summary
5 passed (9.0s)
|
|
π Playwright Run Summary
11 passed (11.4s)
|
|
π Playwright Run Summary
8 passed (11.6s)
|
|
π Playwright Run Summary
7 passed (15.9s)
|
|
π Playwright Run Summary
5 passed (11.5s)
|
|
π Playwright Run Summary
1 skipped
19 passed (8.7s)
|
|
π Playwright Run Summary
23 passed (18.2s)
|
|
π Playwright Run Summary
25 passed (24.4s)
|
|
π Playwright Run Summary
2 passed (16.6s)
|
|
π Playwright Run Summary
1 passed (3.4s)
|
|
π Playwright Run Summary
4 passed (7.1s)
|
|
π Playwright Run Summary
1 passed (3.0s)
|
|
π Playwright Run Summary
10 passed (20.1s)
|
|
π Playwright Run Summary
5 passed (11.9s)
|
|
π Playwright Run Summary
11 passed (5.9s)
|
|
π Playwright Run Summary
10 passed (12.9s)
|
|
π Playwright Run Summary
1 passed (6.4s)
|
|
π Playwright Run Summary
11 passed (9.8s)
|
|
π Playwright Run Summary
7 passed (8.9s)
|
|
π Playwright Run Summary
9 passed (3.6s)
|
|
π Playwright Run Summary
9 passed (3.7s)
|
|
π Playwright Run Summary
8 skipped
6 passed (12.3s)
|
|
π Playwright Run Summary
11 passed (11.2s)
|
|
π Playwright Run Summary
5 passed (8.3s)
|
|
π Playwright Run Summary
4 passed (3.5s)
|
|
π Playwright Run Summary
3 passed (7.0s)
|
|
π Playwright Run Summary
12 passed (9.4s)
|
|
π Playwright Run Summary
3 passed (5.0s)
|
|
π Playwright Run Summary
4 passed (9.3s)
|
|
π Playwright Run Summary
8 passed (9.4s)
|
|
π Playwright Run Summary
1 skipped
19 passed (1.5s)
|
|
π Playwright Run Summary
11 passed (11.3s)
|
|
π Playwright Run Summary
4 passed (3.7s)
|
|
π Playwright Run Summary
6 passed (13.3s)
|
|
π Playwright Run Summary
5 passed (10.6s)
|
|
π Playwright Run Summary
3 passed (6.4s)
|
|
π Playwright Run Summary
19 passed (15.1s)
|
|
π Playwright Run Summary
10 passed (4.2s)
|
|
π Playwright Run Summary
10 passed (4.6s)
|
|
π Playwright Run Summary
11 skipped
2 passed (3.7s)
|
|
π Playwright Run Summary
9 passed (11.0s)
|
|
π Playwright Run Summary
16 passed (18.9s)
|
|
π Playwright Run Summary
11 passed (11.2s)
|
|
π Playwright Run Summary
1 passed (4.7s)
|
|
π Playwright Run Summary
1 skipped
73 passed (15.3s)
|
|
π Playwright Run Summary
30 passed (32.9s)
|
|
π Playwright Run Summary
30 passed (32.8s)
|
|
π Playwright Run Summary
16 passed (10.6s)
|
|
π Playwright Run Summary
3 passed (4.4s)
|
|
π Playwright Run Summary
1 skipped
16 passed (32.7s)
|
|
π Playwright Run Summary
8 passed (8.5s)
|
|
π Playwright Run Summary
13 passed (30.6s)
|
|
π Playwright Run Summary
9 passed (14.2s)
|
|
π Playwright Run Summary
4 passed (8.4s)
|
|
π Playwright Run Summary
5 passed (12.2s)
|
|
π Playwright Run Summary
6 passed (35.9s)
|
|
π Playwright Run Summary
11 passed (20.6s)
|
|
π Playwright Run Summary
4 passed (10.5s)
|
|
π Playwright Run Summary
3 passed (7.5s)
|
|
π Playwright Run Summary
1 passed (2.9s)
|
|
π Playwright Run Summary
16 passed (10.6s)
|
|
π Playwright Run Summary
10 passed (14.8s)
|
|
π Playwright Run Summary
4 passed (11.4s)
|
|
π Playwright Run Summary
9 passed (15.3s)
|
|
π Playwright Run Summary
1 skipped
73 passed (14.3s)
|
|
π Playwright Run Summary
16 passed (20.3s)
|
|
π Playwright Run Summary
23 passed (22.9s)
|
|
π Playwright Run Summary
22 skipped
2 passed (3.3s)
|
|
π Playwright Run Summary
5 passed (12.9s)
|
|
π Playwright Run Summary
22 passed (16.3s)
|
|
π Playwright Run Summary
1 skipped
73 passed (14.8s)
|
|
π Playwright Run Summary
5 passed (13.6s)
|
|
π Playwright Run Summary
10 passed (8.5s)
|
|
π Playwright Run Summary
21 skipped
3 passed (4.9s)
|
|
π Playwright Run Summary
22 skipped
2 passed (3.1s)
|
|
π Playwright Run Summary
1 skipped
73 passed (14.6s)
|
|
π Playwright Run Summary
1 skipped
12 passed (28.8s)
|
|
π Playwright Run Summary
14 passed (42.7s)
|
|
π Playwright Run Summary
1 passed (4.3s)
|
|
π Playwright Run Summary
12 passed (33.2s)
|
|
π Playwright Run Summary
25 passed (51.9s)
|
|
π Playwright Run Summary
2 passed (32.2s)
|
|
π Playwright Run Summary
5 skipped
25 passed (10.5s)
|
|
π Playwright Run Summary
14 passed (44.1s)
|
|
π Playwright Run Summary
6 passed (13.8s)
|
|
π Playwright Run Summary
3 passed (15.2s)
|
|
π Playwright Run Summary
3 passed (10.0s)
|
|
π Playwright Run Summary
5 passed (7.6s)
|
|
π Playwright Run Summary
15 passed (17.6s)
|
|
π Playwright Run Summary
17 passed (30.5s)
|
|
π Playwright Run Summary
1 failed
[chromium] βΊ tests/index.test.ts:42:5 βΊ Websocket.webSocketMessage βββββββββββββββββββββββββββββ
2 skipped
9 passed (7.6s)
|
|
π Playwright Run Summary
2 skipped
10 passed (6.7s)
|
|
π Playwright Run Summary
10 passed (41.6s)
|
|
π Playwright Run Summary
7 passed (8.4s)
|
|
π Playwright Run Summary
10 passed (18.9s)
|
|
π Playwright Run Summary
4 passed (21.2s)
|
|
π Playwright Run Summary
4 passed (13.4s)
|
|
π Playwright Run Summary
11 passed (19.6s)
|
|
π Playwright Run Summary
3 passed (17.2s)
|
|
π Playwright Run Summary
3 passed (11.5s)
|
|
π Playwright Run Summary
16 skipped
12 passed (24.6s)
|
|
π Playwright Run Summary
14 passed (42.9s)
|
|
π Playwright Run Summary
4 skipped
10 passed (17.3s)
|
|
π Playwright Run Summary
13 passed (46.9s)
|
|
π Playwright Run Summary
4 passed (3.5s)
|
|
π Playwright Run Summary
3 passed (21.0s)
|
|
π Playwright Run Summary
3 passed (13.7s)
|
|
π Playwright Run Summary
9 passed (12.3s)
|
|
π Playwright Run Summary
2 passed (30.4s)
|
|
π Playwright Run Summary
25 passed (53.4s)
|
|
π Playwright Run Summary
9 passed (10.4s)
|
|
π Playwright Run Summary
13 passed (43.4s)
|
|
π Playwright Run Summary
4 passed (3.5s)
|
|
π Playwright Run Summary
5 skipped
25 passed (16.3s)
|
|
π Playwright Run Summary
12 passed (19.5s)
|
|
π Playwright Run Summary
8 passed (16.8s)
|
|
π Playwright Run Summary
12 passed (39.6s)
|
|
π Playwright Run Summary
15 passed (31.2s)
|
|
π Playwright Run Summary
13 passed (36.0s)
|
|
π Playwright Run Summary
53 passed (38.6s)
|
|
π Playwright Run Summary
10 passed (22.6s)
|
|
π Playwright Run Summary
10 passed (13.3s)
|
|
π Playwright Run Summary
11 passed (20.1s)
|
|
π Playwright Run Summary
12 passed (42.2s)
|
|
π Playwright Run Summary
12 passed (41.8s)
|
|
π Playwright Run Summary
4 passed (17.4s)
|
|
π Playwright Run Summary
4 passed (9.7s)
|
|
π Playwright Run Summary
3 passed (33.0s)
|
|
π Playwright Run Summary
4 passed (14.0s)
|
|
π Playwright Run Summary
14 passed (42.7s)
|
|
π Playwright Run Summary
2 passed (16.8s)
|
|
π Playwright Run Summary
13 passed (33.3s)
|
|
π Playwright Run Summary
9 passed (27.1s)
|
|
π Playwright Run Summary
9 passed (10.0s)
|
|
π Playwright Run Summary
10 passed (27.2s)
|
|
π Playwright Run Summary
4 passed (33.1s)
|
|
π Playwright Run Summary
2 passed (30.2s)
|
|
π Playwright Run Summary
8 skipped
22 passed (9.7s)
|
|
π Playwright Run Summary
13 passed (44.8s)
|
|
π Playwright Run Summary
14 passed (33.2s)
|
|
π Playwright Run Summary
15 passed (10.5s)
|
|
π Playwright Run Summary
10 passed (32.9s)
|
|
π Playwright Run Summary
16 skipped
12 passed (25.1s)
|
|
π Playwright Run Summary
6 passed (43.9s)
|
|
π Playwright Run Summary
11 passed (43.7s)
|
|
π Playwright Run Summary
2 skipped
7 passed (32.3s)
|
|
π Playwright Run Summary
9 passed (39.5s)
|
|
π Playwright Run Summary
5 passed (34.1s)
|
|
π Playwright Run Summary
5 passed (34.2s)
|
|
π Playwright Run Summary
10 passed (26.0s)
|
|
π Playwright Run Summary
10 passed (6.3s)
|
|
π Playwright Run Summary
10 passed (42.7s)
|
|
π Playwright Run Summary
4 passed (11.3s)
|
|
π Playwright Run Summary
5 passed (34.1s)
|
|
π Playwright Run Summary
13 passed (34.1s)
|
|
π Playwright Run Summary
5 passed (33.7s)
|
|
π Playwright Run Summary
13 passed (13.2s)
|
|
π Playwright Run Summary
22 skipped
2 passed (5.4s)
|
|
π Playwright Run Summary
491 skipped
193 passed (36.1s)
|
|
π Playwright Run Summary
4 passed (12.7s)
|
|
π Playwright Run Summary
2 passed (19.3s)
|
|
π Playwright Run Summary
15 passed (48.9s)
|
|
π Playwright Run Summary
12 passed (35.7s)
|
|
π Playwright Run Summary
14 passed (18.1s)
|
|
π Playwright Run Summary
9 passed (33.6s)
|
|
π Playwright Run Summary
489 skipped
195 passed (36.3s)
|
|
π Playwright Run Summary
7 skipped
23 passed (10.3s)
|
|
π Playwright Run Summary
12 passed (17.2s)
|
|
π Playwright Run Summary
12 passed (17.2s)
|
|
π Playwright Run Summary
1 skipped
29 passed (19.5s)
|
|
π Playwright Run Summary
17 passed (1.1m)
|
|
π Playwright Run Summary
7 skipped
23 passed (10.2s)
|
|
π Playwright Run Summary
12 passed (41.4s)
|
|
π Playwright Run Summary
4 skipped
26 passed (19.8s)
|
|
π Playwright Run Summary
11 passed (40.3s)
|
|
π Playwright Run Summary
22 passed (49.7s)
|
|
π Playwright Run Summary
24 passed (1.1m)
|
|
π Playwright Run Summary
40 passed (34.0s)
|
|
π Playwright Run Summary
9 passed (12.8s)
|
|
π Playwright Run Summary
1 skipped
11 passed (29.4s)
|
|
π Playwright Run Summary
12 passed (10.1s)
|
|
π Playwright Run Summary
3 passed (21.5s)
|
|
π Playwright Run Summary
3 passed (12.6s)
|
|
π Playwright Run Summary
3 passed (35.9s)
|
|
π Playwright Run Summary
3 passed (4.0s)
|
|
π Playwright Run Summary
10 passed (58.0s)
|
|
π Playwright Run Summary
6 skipped
7 passed (34.7s)
|
|
π Playwright Run Summary
13 passed (18.8s)
|
|
π Playwright Run Summary
15 passed (1.2m)
|
|
π Playwright Run Summary
2 passed (17.9s)
|
|
π Playwright Run Summary
15 passed (46.4s)
|
|
π Playwright Run Summary
2 passed (17.9s)
|
|
π Playwright Run Summary
18 passed (1.0m)
|
|
π Playwright Run Summary
2 passed (17.6s)
|
|
π Playwright Run Summary
3 skipped
21 passed (44.3s)
|
|
π Playwright Run Summary
2 passed (17.6s)
|
|
π Playwright Run Summary
13 passed (41.6s)
|
|
π Playwright Run Summary
40 passed (38.7s)
|
|
π Playwright Run Summary
2 passed (16.8s)
|
|
π Playwright Run Summary
18 passed (51.0s)
|
|
π Playwright Run Summary
24 passed (1.1m)
|
|
π Playwright Run Summary
3 passed (39.5s)
|
|
π Playwright Run Summary
3 passed (12.8s)
|
|
π Playwright Run Summary
4 passed (12.9s)
|
|
π Playwright Run Summary
4 passed (17.6s)
|
|
π Playwright Run Summary
4 skipped
51 passed (1.2m)
|
|
π Playwright Run Summary
2 passed (20.2s)
|
|
π Playwright Run Summary
2 skipped
21 passed (41.3s)
|
|
π Playwright Run Summary
3 passed (14.1s)
|
|
π Playwright Run Summary
3 passed (13.6s)
|
|
π Playwright Run Summary
24 passed (1.2m)
|
|
π Playwright Run Summary
4 passed (28.4s)
|
|
π Playwright Run Summary
4 passed (9.0s)
|
|
π Playwright Run Summary
1 failed
[chromium] βΊ tests/performance/trace-propagation.test.ts:20:3 βΊ Trace propagation βΊ should have trace connection
21 passed (1.1m)
|
|
π Playwright Run Summary
2 passed (19.7s)
|
|
π Playwright Run Summary
11 passed (38.3s)
|
|
π Playwright Run Summary
4 skipped
12 passed (29.7s)
|
|
π Playwright Run Summary
2 skipped
14 passed (14.7s)
|
|
π Playwright Run Summary
22 passed (49.6s)
|
|
π Playwright Run Summary
24 passed (1.1m)
|
|
π Playwright Run Summary
24 passed (1.2m)
|
|
π Playwright Run Summary
1 skipped
11 passed (50.7s)
|
|
π Playwright Run Summary
12 passed (8.7s)
|
|
π Playwright Run Summary
3 passed (40.5s)
|
|
π Playwright Run Summary
3 passed (8.0s)
|
|
π Playwright Run Summary
486 skipped
198 passed (38.0s)
|
|
π Playwright Run Summary
4 skipped
12 passed (30.8s)
|
|
π Playwright Run Summary
2 skipped
14 passed (16.0s)
|
|
π Playwright Run Summary
9 passed (59.0s)
|
|
π Playwright Run Summary
9 passed (8.4s)
|
|
π Playwright Run Summary
354 skipped
330 passed (1.4m)
|
|
π Playwright Run Summary
355 skipped
329 passed (1.4m)
|
|
π Playwright Run Summary
13 passed (50.8s)
|
|
π Playwright Run Summary
13 passed (15.8s)
|
|
π Playwright Run Summary
13 passed (41.7s)
|
|
π Playwright Run Summary
13 passed (13.9s)
|
|
π Playwright Run Summary
17 passed (1.1m)
|
|
π Playwright Run Summary
5 passed (53.2s)
|
|
π Playwright Run Summary
5 passed (15.6s)
|
|
π Playwright Run Summary
6 skipped
7 passed (55.1s)
|
|
π Playwright Run Summary
13 passed (18.5s)
|
|
π Playwright Run Summary
1 skipped
170 passed (2.1m)
|
|
π Playwright Run Summary
4 skipped
30 passed (56.7s)
|
|
π Playwright Run Summary
2 skipped
32 passed (1.4m)
|
|
π Playwright Run Summary
4 passed (24.7s)
|
|
π Playwright Run Summary
5 skipped
30 passed (1.4m)
|
|
π Playwright Run Summary
5 skipped
30 passed (49.8s)
|
|
π Playwright Run Summary
1 skipped
5 passed (27.2s)
|
|
π Playwright Run Summary
58 passed (1.6m)
|
|
π Playwright Run Summary
67 passed (2.3m)
|
|
π Playwright Run Summary
1 skipped
5 passed (30.2s)
|
|
π Playwright Run Summary
58 passed (1.6m)
|
|
π Playwright Run Summary
5 skipped
30 passed (1.8m)
|
|
π Playwright Run Summary
4 skipped
31 passed (48.1s)
|
|
π Playwright Run Summary
1 skipped
5 passed (29.5s)
|
|
π Playwright Run Summary
67 passed (2.2m)
|
|
π Playwright Run Summary
5 skipped
166 passed (3.0m)
|
|
π Playwright Run Summary
1 skipped
5 passed (33.5s)
|
|
π Playwright Run Summary
58 passed (1.9m)
|
|
π Playwright Run Summary
44 passed (2.6m)
|
|
π Playwright Run Summary
1 skipped
5 passed (32.0s)
|
|
π Playwright Run Summary
67 passed (2.2m)
|
|
π Playwright Run Summary
193 skipped
491 passed (3.3m)
|
|
π Playwright Run Summary
4 skipped
167 passed (2.4m)
|
|
π Playwright Run Summary
15 skipped
32 passed (1.9m)
|
|
π Playwright Run Summary
5 skipped
42 passed (1.5m)
|
|
π Playwright Run Summary
5 skipped
30 passed (2.2m)
|
|
π Playwright Run Summary
4 skipped
31 passed (50.0s)
|
|
π Playwright Run Summary
16 skipped
32 passed (2.0m)
|
|
π Playwright Run Summary
5 skipped
43 passed (1.5m)
|
|
π Playwright Run Summary
1 skipped
5 passed (32.4s)
|
|
π Playwright Run Summary
67 passed (2.2m)
|
|
π Playwright Run Summary
4 skipped
167 passed (3.8m)
|
|
π Playwright Run Summary
60 skipped
624 passed (4.1m)
|
|
π Playwright Run Summary
16 skipped
32 passed (1.8m)
|
|
π Playwright Run Summary
5 skipped
43 passed (1.8m)
|
|
π Playwright Run Summary
187 skipped
497 passed (3.8m)
|
|
π Playwright Run Summary
2 skipped
32 passed (2.7m)
|
|
π Playwright Run Summary
2 skipped
32 passed (1.3m)
|
|
π Playwright Run Summary
56 skipped
628 passed (4.4m)
|
|
π Playwright Run Summary
197 skipped
487 passed (3.4m)
|
|
π Playwright Run Summary
56 skipped
628 passed (4.2m)
|
|
π Playwright Run Summary
58 skipped
626 passed (4.2m)
|
|
π Playwright Run Summary
13 skipped
35 passed (2.7m)
|
|
π Playwright Run Summary
5 skipped
43 passed (1.6m)
|
|
π Playwright Run Summary
13 skipped
35 passed (3.0m)
|
|
π Playwright Run Summary
5 skipped
43 passed (1.5m)
|
|
π Playwright Run Summary
60 skipped
624 passed (4.3m)
|
|
π Playwright Run Summary
2 skipped
32 passed (3.2m)
|
|
π Playwright Run Summary
2 skipped
32 passed (1.3m)
|
|
π Playwright Run Summary
13 skipped
35 passed (3.8m)
|
|
π Playwright Run Summary
5 skipped
43 passed (1.6m)
|