Skip to content

test(e2e): Add Bun, Deno and Cloudflare variants to react-router-8-framework #58778

test(e2e): Add Bun, Deno and Cloudflare variants to react-router-8-framework

test(e2e): Add Bun, Deno and Cloudflare variants to react-router-8-framework #58778

Triggered via pull request September 23, 2026 16:40
Status Cancelled
Total duration 24m 28s
Artifacts –

build.yml

on: pull_request
Get CI Metadata  /  Get Metadata
9s
Get CI Metadata / Get Metadata
Check lockfile
2m 42s
Check lockfile
Check file formatting
51s
Check file formatting
Check PR branches
4s
Check PR branches
Build Lambda layer
1m 33s
Build Lambda layer
Matrix: job_bundler_plugin_integration_tests
Matrix: job_node_integration_tests
Matrix: job_node_unit_tests
Lint
1m 33s
Lint
Circular Dependency Check
1m 44s
Circular Dependency Check
Browser Unit Tests
49s
Browser Unit Tests
Bun Unit Tests
42s
Bun Unit Tests
Deno Unit Tests
1m 3s
Deno Unit Tests
Cloudflare Integration Tests
7m 34s
Cloudflare Integration Tests
Bun Integration Tests
6m 19s
Bun Integration Tests
Deno Integration Tests
7m 32s
Deno Integration Tests
Check for faulty .d.ts files
41s
Check for faulty .d.ts files
Matrix: job_browser_loader_tests
Matrix: job_browser_playwright_tests
Matrix: job_optional_e2e_tests
Upload Artifacts
0s
Upload Artifacts
Matrix: job_e2e_tests
All required jobs passed or were skipped
5s
All required jobs passed or were skipped
Fit to window
Zoom out
Zoom in

Annotations

22 errors and 316 notices
E2E nextjs-16-standalone (canary, turbopack) Test (optional)
Process completed with exit code 1.
E2E nextjs-16 (canary, turbopack) Test (optional)
Process completed with exit code 1.
E2E react-router-7-framework-static Test
Process completed with exit code 1.
[chromium] β€Ί tests/performance/trace-propagation.test.ts:20:3 β€Ί Trace propagation β€Ί should have trace connection: ../../_temp/test-application/tests/performance/trace-propagation.test.ts#L0
1) [chromium] β€Ί tests/performance/trace-propagation.test.ts:20:3 β€Ί Trace propagation β€Ί should have trace connection Test timeout of 30000ms exceeded.
E2E nuxt-5 Test (optional)
Process completed with exit code 1.
[chromium] β€Ί tests/errors.client.test.ts:103:3 β€Ί client-side errors β€Ί page is still interactive after client error: ../../_temp/test-application/tests/errors.client.test.ts#L0
1) [chromium] β€Ί tests/errors.client.test.ts:103:3 β€Ί client-side errors β€Ί page is still interactive after client error Test timeout of 30000ms exceeded.
Cloudflare Integration Tests
Process completed with exit code 1.
suites/tracing/headers/test.ts > Tracing headers: dev-packages/cloudflare-integration-tests/runner.ts#L264
AssertionError: expected [ { …(4) }, …(1) ] to deeply equal [ { …(4) }, …(1) ] - Expected + Received @@ -80,10 +80,11 @@ }, ], "version": "11.0.0", }, "timestamp": Any<Number>, + "transaction": "GET /", "user": { "ip_address": "127.0.0.1", }, }, ], ❯ assertEnvelopeMatches runner.ts:264:28 ❯ newEnvelope runner.ts:328:13 ❯ ../test-utils/src/server.ts:19:7 ❯ Layer.handle [as handle_request] ../../node_modules/express/lib/router/layer.js:95:5 ❯ next ../../node_modules/express/lib/router/route.js:149:13 ❯ Route.dispatch ../../node_modules/express/lib/router/route.js:119:3 ❯ Layer.handle [as handle_request] ../../node_modules/express/lib/router/layer.js:95:5 ❯ ../../node_modules/express/lib/router/index.js:284:15 ❯ param ../../node_modules/express/lib/router/index.js:365:14 ❯ param ../../node_modules/express/lib/router/index.js:376:14
suites/tracing/dsc-url-source/test.ts > omits the span name from the DSC for url-source spans when tracing is enabled: dev-packages/cloudflare-integration-tests/suites/tracing/dsc-url-source/test.ts#L5
Error: Test timed out in 60000ms. If this is a long-running test, pass a timeout value as the last argument or configure it globally with "testTimeout". ❯ suites/tracing/dsc-url-source/test.ts:5:1
suites/integrations/http-server/test.ts > Does not capture body for POST without content: dev-packages/cloudflare-integration-tests/runner.ts#L264
AssertionError: expected [ { …(4) }, …(1) ] to deeply equal [ { …(4) }, …(1) ] - Expected + Received @@ -54,10 +54,11 @@ }, ], "version": "11.0.0", }, "timestamp": Any<Number>, + "transaction": "POST /post-no-body", "user": { "ip_address": "127.0.0.1", }, }, ], ❯ assertEnvelopeMatches runner.ts:264:28 ❯ newEnvelope runner.ts:328:13 ❯ ../test-utils/src/server.ts:19:7 ❯ Layer.handle [as handle_request] ../../node_modules/express/lib/router/layer.js:95:5 ❯ next ../../node_modules/express/lib/router/route.js:149:13 ❯ Route.dispatch ../../node_modules/express/lib/router/route.js:119:3 ❯ Layer.handle [as handle_request] ../../node_modules/express/lib/router/layer.js:95:5 ❯ ../../node_modules/express/lib/router/index.js:284:15 ❯ param ../../node_modules/express/lib/router/index.js:365:14 ❯ param ../../node_modules/express/lib/router/index.js:376:14
suites/integrations/http-server/test.ts > Captures plain text request body: dev-packages/cloudflare-integration-tests/runner.ts#L264
AssertionError: expected [ { …(4) }, …(1) ] to deeply equal [ { …(4) }, …(1) ] - Expected + Received @@ -55,10 +55,11 @@ }, ], "version": "11.0.0", }, "timestamp": Any<Number>, + "transaction": "POST /post-text", "user": { "ip_address": "127.0.0.1", }, }, ], ❯ assertEnvelopeMatches runner.ts:264:28 ❯ newEnvelope runner.ts:328:13 ❯ ../test-utils/src/server.ts:19:7 ❯ Layer.handle [as handle_request] ../../node_modules/express/lib/router/layer.js:95:5 ❯ next ../../node_modules/express/lib/router/route.js:149:13 ❯ Route.dispatch ../../node_modules/express/lib/router/route.js:119:3 ❯ Layer.handle [as handle_request] ../../node_modules/express/lib/router/layer.js:95:5 ❯ ../../node_modules/express/lib/router/index.js:284:15 ❯ param ../../node_modules/express/lib/router/index.js:365:14 ❯ param ../../node_modules/express/lib/router/index.js:376:14
suites/integrations/http-server/test.ts > Captures form-urlencoded request body: dev-packages/cloudflare-integration-tests/runner.ts#L264
AssertionError: expected [ { …(4) }, …(1) ] to deeply equal [ { …(4) }, …(1) ] - Expected + Received @@ -55,10 +55,11 @@ }, ], "version": "11.0.0", }, "timestamp": Any<Number>, + "transaction": "POST /post-form", "user": { "ip_address": "127.0.0.1", }, }, ], ❯ assertEnvelopeMatches runner.ts:264:28 ❯ newEnvelope runner.ts:328:13 ❯ ../test-utils/src/server.ts:19:7 ❯ Layer.handle [as handle_request] ../../node_modules/express/lib/router/layer.js:95:5 ❯ next ../../node_modules/express/lib/router/route.js:149:13 ❯ Route.dispatch ../../node_modules/express/lib/router/route.js:119:3 ❯ Layer.handle [as handle_request] ../../node_modules/express/lib/router/layer.js:95:5 ❯ ../../node_modules/express/lib/router/index.js:284:15 ❯ param ../../node_modules/express/lib/router/index.js:365:14 ❯ param ../../node_modules/express/lib/router/index.js:376:14
suites/integrations/http-server/test.ts > Captures JSON request body: dev-packages/cloudflare-integration-tests/runner.ts#L264
AssertionError: expected [ { …(4) }, …(1) ] to deeply equal [ { …(4) }, …(1) ] - Expected + Received @@ -55,10 +55,11 @@ }, ], "version": "11.0.0", }, "timestamp": Any<Number>, + "transaction": "POST /post-json", "user": { "ip_address": "127.0.0.1", }, }, ], ❯ assertEnvelopeMatches runner.ts:264:28 ❯ newEnvelope runner.ts:328:13 ❯ ../test-utils/src/server.ts:19:7 ❯ Layer.handle [as handle_request] ../../node_modules/express/lib/router/layer.js:95:5 ❯ next ../../node_modules/express/lib/router/route.js:149:13 ❯ Route.dispatch ../../node_modules/express/lib/router/route.js:119:3 ❯ Layer.handle [as handle_request] ../../node_modules/express/lib/router/layer.js:95:5 ❯ ../../node_modules/express/lib/router/index.js:284:15 ❯ param ../../node_modules/express/lib/router/index.js:365:14 ❯ param ../../node_modules/express/lib/router/index.js:376:14
suites/double-instrumentation/test.ts > Only sends one error event when withSentry is called twice: dev-packages/cloudflare-integration-tests/runner.ts#L264
AssertionError: expected [ { …(4) }, …(1) ] to deeply equal [ { …(4) }, …(1) ] - Expected + Received @@ -68,10 +68,11 @@ }, ], "version": "11.0.0", }, "timestamp": Any<Number>, + "transaction": "GET /error", "user": { "ip_address": "127.0.0.1", }, }, ], ❯ assertEnvelopeMatches runner.ts:264:28 ❯ newEnvelope runner.ts:328:13 ❯ ../test-utils/src/server.ts:19:7 ❯ Layer.handle [as handle_request] ../../node_modules/express/lib/router/layer.js:95:5 ❯ next ../../node_modules/express/lib/router/route.js:149:13 ❯ Route.dispatch ../../node_modules/express/lib/router/route.js:119:3 ❯ Layer.handle [as handle_request] ../../node_modules/express/lib/router/layer.js:95:5 ❯ ../../node_modules/express/lib/router/index.js:284:15 ❯ param ../../node_modules/express/lib/router/index.js:365:14 ❯ param ../../node_modules/express/lib/router/index.js:376:14
suites/basic/test.ts > Basic error in fetch handler: dev-packages/cloudflare-integration-tests/runner.ts#L264
AssertionError: expected [ { …(4) }, …(1) ] to deeply equal [ { …(4) }, …(1) ] - Expected + Received @@ -68,10 +68,11 @@ }, ], "version": "11.0.0", }, "timestamp": Any<Number>, + "transaction": "GET /", "user": { "ip_address": "127.0.0.1", }, }, ], ❯ assertEnvelopeMatches runner.ts:264:28 ❯ newEnvelope runner.ts:328:13 ❯ ../test-utils/src/server.ts:19:7 ❯ Layer.handle [as handle_request] ../../node_modules/express/lib/router/layer.js:95:5 ❯ next ../../node_modules/express/lib/router/route.js:149:13 ❯ Route.dispatch ../../node_modules/express/lib/router/route.js:119:3 ❯ Layer.handle [as handle_request] ../../node_modules/express/lib/router/layer.js:95:5 ❯ ../../node_modules/express/lib/router/index.js:284:15 ❯ param ../../node_modules/express/lib/router/index.js:365:14 ❯ param ../../node_modules/express/lib/router/index.js:376:14
Node (22) Integration Tests
Canceling since a higher priority waiting request for CI: Build & Test-jp/e2e-runtime-variants-poc exists
Node (22) Integration Tests
The operation was canceled.
Node (24) (TS 5.0) Integration Tests
Canceling since a higher priority waiting request for CI: Build & Test-jp/e2e-runtime-variants-poc exists
Node (24) (TS 5.0) Integration Tests
The operation was canceled.
E2E nestjs-basic Test
The job has exceeded the maximum execution time of 15m0s
All required jobs passed or were skipped
Process completed with exit code 1.
CI: Build & Test
Canceling since a higher priority waiting request for CI: Build & Test-jp/e2e-runtime-variants-poc exists
🎭 Playwright Run Summary
11 passed (11.4s)
🎭 Playwright Run Summary
1 passed (6.0s)
🎭 Playwright Run Summary
1 skipped 19 passed (2.1s)
🎭 Playwright Run Summary
3 skipped 17 passed (8.5s)
🎭 Playwright Run Summary
4 passed (7.4s)
🎭 Playwright Run Summary
2 passed (4.7s)
🎭 Playwright Run Summary
10 passed (4.3s)
🎭 Playwright Run Summary
10 passed (4.6s)
🎭 Playwright Run Summary
1 passed (6.0s)
🎭 Playwright Run Summary
11 passed (9.8s)
🎭 Playwright Run Summary
12 passed (11.2s)
🎭 Playwright Run Summary
2 passed (5.2s)
🎭 Playwright Run Summary
4 passed (7.1s)
🎭 Playwright Run Summary
10 passed (20.0s)
🎭 Playwright Run Summary
11 passed (11.3s)
🎭 Playwright Run Summary
8 passed (10.5s)
🎭 Playwright Run Summary
2 skipped 14 passed (16.6s)
🎭 Playwright Run Summary
4 passed (9.3s)
🎭 Playwright Run Summary
1 skipped 73 passed (15.5s)
🎭 Playwright Run Summary
5 passed (12.8s)
🎭 Playwright Run Summary
5 passed (11.1s)
🎭 Playwright Run Summary
1 passed (2.5s)
🎭 Playwright Run Summary
5 passed (7.0s)
🎭 Playwright Run Summary
7 passed (9.6s)
🎭 Playwright Run Summary
11 passed (9.4s)
🎭 Playwright Run Summary
3 passed (5.0s)
🎭 Playwright Run Summary
5 passed (9.0s)
🎭 Playwright Run Summary
3 passed (15.8s)
🎭 Playwright Run Summary
3 passed (11.4s)
🎭 Playwright Run Summary
1 passed (3.3s)
🎭 Playwright Run Summary
23 passed (20.1s)
🎭 Playwright Run Summary
7 passed (5.2s)
🎭 Playwright Run Summary
15 passed (10.5s)
🎭 Playwright Run Summary
3 passed (16.1s)
🎭 Playwright Run Summary
3 passed (12.7s)
🎭 Playwright Run Summary
4 passed (4.1s)
🎭 Playwright Run Summary
11 passed (19.9s)
🎭 Playwright Run Summary
10 passed (9.6s)
🎭 Playwright Run Summary
3 passed (6.0s)
🎭 Playwright Run Summary
4 passed (12.7s)
🎭 Playwright Run Summary
16 passed (10.5s)
🎭 Playwright Run Summary
16 passed (20.4s)
🎭 Playwright Run Summary
1 passed (5.8s)
🎭 Playwright Run Summary
1 passed (3.5s)
🎭 Playwright Run Summary
4 passed (4.4s)
🎭 Playwright Run Summary
1 passed (3.5s)
🎭 Playwright Run Summary
1 passed (3.5s)
🎭 Playwright Run Summary
4 passed (4.9s)
🎭 Playwright Run Summary
19 passed (12.0s)
🎭 Playwright Run Summary
11 skipped 2 passed (3.7s)
🎭 Playwright Run Summary
2 passed (3.6s)
🎭 Playwright Run Summary
7 passed (12.8s)
🎭 Playwright Run Summary
16 passed (8.2s)
🎭 Playwright Run Summary
11 passed (7.1s)
🎭 Playwright Run Summary
3 passed (5.0s)
🎭 Playwright Run Summary
7 passed (3.2s)
🎭 Playwright Run Summary
5 passed (13.5s)
🎭 Playwright Run Summary
8 passed (8.4s)
🎭 Playwright Run Summary
2 passed (31.1s)
🎭 Playwright Run Summary
4 passed (33.8s)
🎭 Playwright Run Summary
11 passed (20.1s)
🎭 Playwright Run Summary
22 passed (19.4s)
🎭 Playwright Run Summary
3 passed (17.5s)
🎭 Playwright Run Summary
3 passed (11.0s)
🎭 Playwright Run Summary
10 passed (11.4s)
🎭 Playwright Run Summary
9 passed (3.1s)
🎭 Playwright Run Summary
9 passed (3.2s)
🎭 Playwright Run Summary
9 passed (14.3s)
🎭 Playwright Run Summary
5 passed (11.9s)
🎭 Playwright Run Summary
6 passed (14.3s)
🎭 Playwright Run Summary
2 passed (4.0s)
🎭 Playwright Run Summary
2 passed (4.0s)
🎭 Playwright Run Summary
23 passed (11.2s)
🎭 Playwright Run Summary
7 passed (17.2s)
🎭 Playwright Run Summary
16 passed (20.4s)
🎭 Playwright Run Summary
5 passed (8.9s)
🎭 Playwright Run Summary
4 passed (12.1s)
🎭 Playwright Run Summary
6 passed (13.4s)
🎭 Playwright Run Summary
10 passed (31.1s)
🎭 Playwright Run Summary
4 skipped 10 passed (16.4s)
🎭 Playwright Run Summary
14 passed (40.3s)
🎭 Playwright Run Summary
8 skipped 6 passed (10.9s)
🎭 Playwright Run Summary
1 skipped 73 passed (15.6s)
🎭 Playwright Run Summary
12 passed (9.0s)
🎭 Playwright Run Summary
2 skipped 7 passed (32.2s)
🎭 Playwright Run Summary
5 passed (11.5s)
🎭 Playwright Run Summary
2 skipped 10 passed (6.2s)
🎭 Playwright Run Summary
2 skipped 10 passed (6.0s)
🎭 Playwright Run Summary
1 skipped 73 passed (14.6s)
🎭 Playwright Run Summary
8 passed (9.5s)
🎭 Playwright Run Summary
17 passed (30.3s)
🎭 Playwright Run Summary
6 passed (36.0s)
🎭 Playwright Run Summary
1 passed (4.7s)
🎭 Playwright Run Summary
3 passed (3.2s)
🎭 Playwright Run Summary
25 passed (22.6s)
🎭 Playwright Run Summary
10 passed (29.3s)
🎭 Playwright Run Summary
1 skipped 12 passed (28.1s)
🎭 Playwright Run Summary
23 passed (20.8s)
🎭 Playwright Run Summary
9 passed (11.2s)
🎭 Playwright Run Summary
12 passed (11.3s)
🎭 Playwright Run Summary
5 passed (13.2s)
🎭 Playwright Run Summary
21 skipped 3 passed (3.8s)
🎭 Playwright Run Summary
12 passed (40.6s)
🎭 Playwright Run Summary
10 passed (17.4s)
🎭 Playwright Run Summary
5 passed (5.4s)
🎭 Playwright Run Summary
4 passed (9.1s)
🎭 Playwright Run Summary
9 passed (15.7s)
🎭 Playwright Run Summary
2 passed (28.5s)
🎭 Playwright Run Summary
5 passed (11.6s)
🎭 Playwright Run Summary
4 passed (12.2s)
🎭 Playwright Run Summary
4 passed (9.7s)
🎭 Playwright Run Summary
8 passed (5.4s)
🎭 Playwright Run Summary
1 skipped 16 passed (33.5s)
🎭 Playwright Run Summary
10 passed (12.9s)
🎭 Playwright Run Summary
12 passed (32.9s)
🎭 Playwright Run Summary
1 skipped 73 passed (14.5s)
🎭 Playwright Run Summary
4 passed (4.2s)
🎭 Playwright Run Summary
11 passed (9.5s)
🎭 Playwright Run Summary
30 passed (37.3s)
🎭 Playwright Run Summary
12 passed (17.1s)
🎭 Playwright Run Summary
12 passed (17.2s)
🎭 Playwright Run Summary
22 passed (46.9s)
🎭 Playwright Run Summary
3 passed (30.6s)
🎭 Playwright Run Summary
6 passed (13.7s)
🎭 Playwright Run Summary
14 passed (43.8s)
🎭 Playwright Run Summary
3 passed (7.7s)
🎭 Playwright Run Summary
15 passed (17.5s)
🎭 Playwright Run Summary
9 passed (12.4s)
🎭 Playwright Run Summary
22 passed (45.8s)
🎭 Playwright Run Summary
9 passed (37.7s)
🎭 Playwright Run Summary
22 skipped 2 passed (3.7s)
🎭 Playwright Run Summary
4 passed (20.7s)
🎭 Playwright Run Summary
4 passed (12.0s)
🎭 Playwright Run Summary
8 passed (14.8s)
🎭 Playwright Run Summary
3 passed (5.3s)
🎭 Playwright Run Summary
1 skipped 19 passed (8.1s)
🎭 Playwright Run Summary
9 passed (12.5s)
🎭 Playwright Run Summary
13 passed (34.8s)
🎭 Playwright Run Summary
6 passed (44.6s)
🎭 Playwright Run Summary
11 passed (39.3s)
🎭 Playwright Run Summary
10 passed (11.9s)
🎭 Playwright Run Summary
10 passed (42.7s)
🎭 Playwright Run Summary
2 passed (18.3s)
🎭 Playwright Run Summary
2 passed (32.9s)
🎭 Playwright Run Summary
12 passed (36.7s)
🎭 Playwright Run Summary
2 passed (29.2s)
🎭 Playwright Run Summary
14 passed (42.6s)
🎭 Playwright Run Summary
12 passed (42.4s)
🎭 Playwright Run Summary
25 passed (56.0s)
🎭 Playwright Run Summary
13 passed (30.5s)
🎭 Playwright Run Summary
12 passed (40.8s)
🎭 Playwright Run Summary
4 passed (25.2s)
🎭 Playwright Run Summary
4 passed (25.3s)
🎭 Playwright Run Summary
3 passed (21.5s)
🎭 Playwright Run Summary
3 passed (12.6s)
🎭 Playwright Run Summary
40 passed (35.0s)
🎭 Playwright Run Summary
10 passed (19.6s)
🎭 Playwright Run Summary
10 passed (12.5s)
🎭 Playwright Run Summary
11 passed (20.1s)
🎭 Playwright Run Summary
2 passed (18.9s)
🎭 Playwright Run Summary
15 passed (51.0s)
🎭 Playwright Run Summary
9 passed (12.3s)
🎭 Playwright Run Summary
22 skipped 2 passed (5.6s)
🎭 Playwright Run Summary
40 passed (34.9s)
🎭 Playwright Run Summary
25 passed (59.0s)
🎭 Playwright Run Summary
1 skipped 11 passed (29.5s)
🎭 Playwright Run Summary
12 passed (10.8s)
🎭 Playwright Run Summary
12 passed (20.8s)
🎭 Playwright Run Summary
13 passed (44.4s)
🎭 Playwright Run Summary
5 passed (14.0s)
🎭 Playwright Run Summary
13 passed (42.3s)
🎭 Playwright Run Summary
12 passed (41.8s)
🎭 Playwright Run Summary
10 passed (26.0s)
🎭 Playwright Run Summary
10 passed (6.4s)
🎭 Playwright Run Summary
14 passed (42.7s)
🎭 Playwright Run Summary
13 passed (46.6s)
🎭 Playwright Run Summary
2 passed (18.0s)
🎭 Playwright Run Summary
13 passed (35.5s)
🎭 Playwright Run Summary
14 passed (33.7s)
🎭 Playwright Run Summary
22 skipped 2 passed (4.9s)
🎭 Playwright Run Summary
15 passed (31.4s)
🎭 Playwright Run Summary
3 passed (31.8s)
🎭 Playwright Run Summary
3 passed (7.2s)
🎭 Playwright Run Summary
4 passed (3.5s)
🎭 Playwright Run Summary
22 passed (52.0s)
🎭 Playwright Run Summary
3 passed (22.2s)
🎭 Playwright Run Summary
3 passed (13.9s)
🎭 Playwright Run Summary
5 passed (32.3s)
🎭 Playwright Run Summary
5 passed (32.8s)
🎭 Playwright Run Summary
11 passed (38.0s)
🎭 Playwright Run Summary
4 passed (12.1s)
🎭 Playwright Run Summary
16 skipped 12 passed (27.5s)
🎭 Playwright Run Summary
4 passed (11.9s)
🎭 Playwright Run Summary
9 passed (24.0s)
🎭 Playwright Run Summary
9 passed (8.0s)
🎭 Playwright Run Summary
10 passed (41.6s)
🎭 Playwright Run Summary
6 skipped 7 passed (35.5s)
🎭 Playwright Run Summary
13 passed (19.1s)
🎭 Playwright Run Summary
16 skipped 12 passed (26.4s)
🎭 Playwright Run Summary
4 passed (38.6s)
🎭 Playwright Run Summary
4 passed (9.7s)
🎭 Playwright Run Summary
17 passed (1.1m)
🎭 Playwright Run Summary
22 passed (49.6s)
🎭 Playwright Run Summary
15 passed (1.2m)
🎭 Playwright Run Summary
22 passed (53.5s)
🎭 Playwright Run Summary
22 passed (1.1m)
🎭 Playwright Run Summary
22 passed (54.3s)
🎭 Playwright Run Summary
10 passed (55.3s)
🎭 Playwright Run Summary
1 failed [chromium] β€Ί tests/performance/trace-propagation.test.ts:20:3 β€Ί Trace propagation β€Ί should have trace connection 21 passed (1.1m)
🎭 Playwright Run Summary
53 passed (38.0s)
🎭 Playwright Run Summary
17 passed (1.2m)
🎭 Playwright Run Summary
3 passed (39.2s)
🎭 Playwright Run Summary
3 passed (12.7s)
🎭 Playwright Run Summary
5 passed (47.0s)
🎭 Playwright Run Summary
5 passed (13.6s)
🎭 Playwright Run Summary
13 passed (48.4s)
🎭 Playwright Run Summary
13 passed (15.9s)
🎭 Playwright Run Summary
14 passed (18.4s)
🎭 Playwright Run Summary
2 passed (17.0s)
🎭 Playwright Run Summary
18 passed (50.8s)
🎭 Playwright Run Summary
3 passed (28.6s)
🎭 Playwright Run Summary
3 passed (3.3s)
🎭 Playwright Run Summary
13 passed (53.5s)
🎭 Playwright Run Summary
13 passed (14.5s)
🎭 Playwright Run Summary
4 skipped 12 passed (33.5s)
🎭 Playwright Run Summary
2 skipped 14 passed (16.9s)
🎭 Playwright Run Summary
2 passed (18.3s)
🎭 Playwright Run Summary
15 passed (45.2s)
🎭 Playwright Run Summary
9 passed (33.5s)
🎭 Playwright Run Summary
4 skipped 12 passed (34.4s)
🎭 Playwright Run Summary
2 skipped 14 passed (15.6s)
🎭 Playwright Run Summary
5 passed (34.6s)
🎭 Playwright Run Summary
5 passed (34.6s)
🎭 Playwright Run Summary
2 passed (18.6s)
🎭 Playwright Run Summary
2 skipped 21 passed (42.9s)
🎭 Playwright Run Summary
1 failed [chromium] β€Ί tests/errors.client.test.ts:103:3 β€Ί client-side errors β€Ί page is still interactive after client error 4 skipped 50 passed (1.7m)
🎭 Playwright Run Summary
491 skipped 193 passed (39.1s)
🎭 Playwright Run Summary
2 passed (21.5s)
🎭 Playwright Run Summary
3 skipped 21 passed (46.1s)
🎭 Playwright Run Summary
489 skipped 195 passed (40.7s)
🎭 Playwright Run Summary
2 passed (17.3s)
🎭 Playwright Run Summary
18 passed (1.1m)
🎭 Playwright Run Summary
486 skipped 198 passed (39.3s)
🎭 Playwright Run Summary
2 passed (20.1s)
🎭 Playwright Run Summary
11 passed (47.9s)
🎭 Playwright Run Summary
6 skipped 7 passed (55.1s)
🎭 Playwright Run Summary
13 passed (18.8s)
🎭 Playwright Run Summary
4 skipped 30 passed (54.7s)
🎭 Playwright Run Summary
2 skipped 32 passed (1.3m)
🎭 Playwright Run Summary
1 passed (4.7s)
🎭 Playwright Run Summary
13 passed (52.4s)
🎭 Playwright Run Summary
13 passed (14.6s)
🎭 Playwright Run Summary
5 skipped 30 passed (1.4m)
🎭 Playwright Run Summary
5 skipped 30 passed (50.0s)
🎭 Playwright Run Summary
9 passed (1.1m)
🎭 Playwright Run Summary
9 passed (8.8s)
🎭 Playwright Run Summary
7 skipped 23 passed (10.7s)
🎭 Playwright Run Summary
4 passed (26.0s)
🎭 Playwright Run Summary
7 skipped 23 passed (10.0s)
🎭 Playwright Run Summary
2 passed (22.4s)
🎭 Playwright Run Summary
13 passed (52.9s)
🎭 Playwright Run Summary
5 skipped 25 passed (11.7s)
🎭 Playwright Run Summary
8 skipped 22 passed (9.8s)
🎭 Playwright Run Summary
354 skipped 330 passed (1.5m)
🎭 Playwright Run Summary
1 skipped 11 passed (1.3m)
🎭 Playwright Run Summary
12 passed (11.0s)
🎭 Playwright Run Summary
1 skipped 5 passed (27.5s)
🎭 Playwright Run Summary
58 passed (1.6m)
🎭 Playwright Run Summary
4 skipped 26 passed (16.7s)
🎭 Playwright Run Summary
1 skipped 5 passed (27.3s)
🎭 Playwright Run Summary
58 passed (1.7m)
🎭 Playwright Run Summary
5 skipped 25 passed (16.6s)
🎭 Playwright Run Summary
1 skipped 5 passed (29.4s)
🎭 Playwright Run Summary
58 passed (1.6m)
🎭 Playwright Run Summary
1 skipped 29 passed (21.6s)
🎭 Playwright Run Summary
44 passed (2.6m)
🎭 Playwright Run Summary
1 skipped 5 passed (29.5s)
🎭 Playwright Run Summary
67 passed (2.2m)
🎭 Playwright Run Summary
1 skipped 5 passed (32.2s)
🎭 Playwright Run Summary
67 passed (2.2m)
🎭 Playwright Run Summary
355 skipped 329 passed (1.5m)
🎭 Playwright Run Summary
1 skipped 5 passed (31.3s)
🎭 Playwright Run Summary
67 passed (2.2m)
🎭 Playwright Run Summary
67 passed (2.5m)
🎭 Playwright Run Summary
4 skipped 167 passed (2.5m)
🎭 Playwright Run Summary
1 skipped 170 passed (2.5m)
🎭 Playwright Run Summary
15 skipped 32 passed (1.8m)
🎭 Playwright Run Summary
5 skipped 42 passed (1.4m)
🎭 Playwright Run Summary
16 skipped 32 passed (1.9m)
🎭 Playwright Run Summary
5 skipped 43 passed (1.6m)
🎭 Playwright Run Summary
5 skipped 30 passed (2.2m)
🎭 Playwright Run Summary
4 skipped 31 passed (50.8s)
🎭 Playwright Run Summary
193 skipped 491 passed (3.4m)
🎭 Playwright Run Summary
5 skipped 30 passed (2.2m)
🎭 Playwright Run Summary
4 skipped 31 passed (50.9s)
🎭 Playwright Run Summary
16 skipped 32 passed (2.2m)
🎭 Playwright Run Summary
5 skipped 43 passed (1.6m)
🎭 Playwright Run Summary
197 skipped 487 passed (3.3m)
🎭 Playwright Run Summary
4 skipped 167 passed (3.7m)
🎭 Playwright Run Summary
13 skipped 35 passed (2.9m)
🎭 Playwright Run Summary
5 skipped 43 passed (1.5m)
🎭 Playwright Run Summary
2 skipped 32 passed (2.7m)
🎭 Playwright Run Summary
2 skipped 32 passed (1.3m)
🎭 Playwright Run Summary
187 skipped 497 passed (3.8m)
🎭 Playwright Run Summary
13 skipped 35 passed (3.0m)
🎭 Playwright Run Summary
5 skipped 43 passed (1.5m)
🎭 Playwright Run Summary
58 skipped 626 passed (4.3m)
🎭 Playwright Run Summary
5 skipped 166 passed (2.8m)
🎭 Playwright Run Summary
60 skipped 624 passed (4.4m)
🎭 Playwright Run Summary
60 skipped 624 passed (4.4m)
🎭 Playwright Run Summary
13 skipped 35 passed (2.8m)
🎭 Playwright Run Summary
5 skipped 43 passed (1.5m)
🎭 Playwright Run Summary
2 skipped 32 passed (3.2m)
🎭 Playwright Run Summary
2 skipped 32 passed (1.3m)
🎭 Playwright Run Summary
56 skipped 628 passed (4.2m)
🎭 Playwright Run Summary
56 skipped 628 passed (4.5m)